Reaction Details
TargetDipeptidyl peptidase 4
LigandBDBM50225046
Substrate/Competitorn/a
Meas. Tech.ChEMBL_450927 (CHEMBL900014)
Ki 1420±n/a nM
Citation Simpkins, LMBolton, SPi, ZSutton, JCKwon, CZhao, GMagnin, DRAugeri, DJGungor, TRotella, DPSun, ZLiu, YSlusarchyk, WSMarcinkeviciene, JRobertson, JGWang, ARobl, JAAtwal, KSZahler, RLParker, RAKirby, MSHamann, LG Potent non-nitrile dipeptidic dipeptidyl peptidase IV inhibitors. Bioorg Med Chem Lett17:6476-80 (2007) 
 
Dipeptidyl peptidase 4
Name:Dipeptidyl peptidase 4
Type:Enzyme
Mol. Mass.:88271.01
Organism:Homo sapiens (Human)
Description:P27487
Residue:766
BDBM50225046
NameBDBM50225046
Synonyms:(S)-2-amino-2-(3-hydroxy-adamantan-1-yl)-1-(1H-isoindol-2-yl)-ethanone | CHEMBL399411
TypeSmall organic molecule
Emp. Form.C20H26N2O2
Mol. Mass.326.4326
SMILESN[C@H](C(=O)N1Cc2ccccc2C1)C12CC3CC(CC(O)(C3)C1)C2