Reaction Details
TargetDipeptidyl peptidase 4
LigandBDBM50225058
Substrate/Competitorn/a
Meas. Tech.ChEMBL_450927 (CHEMBL900014)
Ki 1010±n/a nM
Citation Simpkins, LMBolton, SPi, ZSutton, JCKwon, CZhao, GMagnin, DRAugeri, DJGungor, TRotella, DPSun, ZLiu, YSlusarchyk, WSMarcinkeviciene, JRobertson, JGWang, ARobl, JAAtwal, KSZahler, RLParker, RAKirby, MSHamann, LG Potent non-nitrile dipeptidic dipeptidyl peptidase IV inhibitors. Bioorg Med Chem Lett17:6476-80 (2007) 
 
Dipeptidyl peptidase 4
Name:Dipeptidyl peptidase 4
Type:Enzyme
Mol. Mass.:88271.01
Organism:Homo sapiens (Human)
Description:P27487
Residue:766
BDBM50225058
NameBDBM50225058
Synonyms:(S)-1-((1S,5R)-2-aza-bicyclo[3.1.0]hexan-2-yl)-2-amino-4,4-dimethylpentan-1-one | CHEMBL395184
TypeSmall organic molecule
Emp. Form.C12H22N2O
Mol. Mass.210.3159
SMILESCC(C)(C)C[C@H](N)C(=O)N1CC[C@@H]2C[C@H]12