Reaction Details
TargetDipeptidyl peptidase 4
LigandBDBM50225073
Substrate/Competitorn/a
Meas. Tech.ChEMBL_450927 (CHEMBL900014)
Ki 2.9±n/a nM
Citation Simpkins, LMBolton, SPi, ZSutton, JCKwon, CZhao, GMagnin, DRAugeri, DJGungor, TRotella, DPSun, ZLiu, YSlusarchyk, WSMarcinkeviciene, JRobertson, JGWang, ARobl, JAAtwal, KSZahler, RLParker, RAKirby, MSHamann, LG Potent non-nitrile dipeptidic dipeptidyl peptidase IV inhibitors. Bioorg Med Chem Lett17:6476-80 (2007) 
 
Dipeptidyl peptidase 4
Name:Dipeptidyl peptidase 4
Type:Enzyme
Mol. Mass.:88271.01
Organism:Homo sapiens (Human)
Description:P27487
Residue:766
BDBM50225073
NameBDBM50225073
Synonyms:(S)-2-amino-1-(1S,5R)-2-aza-bicyclo[3.1.0]hex-2-yl-2-(3-hydroxy-5,7-dimethyl-adamantan-1-yl)-ethanone | CHEMBL391211
TypeSmall organic molecule
Emp. Form.C19H30N2O2
Mol. Mass.318.4537
SMILESCC12CC3(C)CC(O)(C1)CC(C2)(C3)[C@H](N)C(=O)N1CC[C@@H]2C[C@H]12