Reaction Details
TargetDipeptidyl peptidase 4
LigandBDBM50225074
Substrate/Competitorn/a
Meas. Tech.ChEMBL_450927 (CHEMBL900014)
Ki 0.6±n/a nM
Citation Simpkins, LMBolton, SPi, ZSutton, JCKwon, CZhao, GMagnin, DRAugeri, DJGungor, TRotella, DPSun, ZLiu, YSlusarchyk, WSMarcinkeviciene, JRobertson, JGWang, ARobl, JAAtwal, KSZahler, RLParker, RAKirby, MSHamann, LG Potent non-nitrile dipeptidic dipeptidyl peptidase IV inhibitors. Bioorg Med Chem Lett17:6476-80 (2007) 
 
Dipeptidyl peptidase 4
Name:Dipeptidyl peptidase 4
Type:Enzyme
Mol. Mass.:88271.01
Organism:Homo sapiens (Human)
Description:P27487
Residue:766
BDBM50225074
NameBDBM50225074
Synonyms:(1S,3S,5S)-2-[(S)-2-amino-2-(3-hydroxy-adamantan-1-yl)-acetyl]-2-aza-bicyclo[3.1.0]hexane-3-carbonitrile BMS-477118 SAXAGLIPTIN
TypeSmall organic molecule
Emp. Form.C18H25N3O2
Mol. Mass.315.41
SMILESN[C@H](C(=O)N1[C@H]2C[C@H]2C[C@H]1C#N)C12CC3CC(CC(O)(C3)C1)C2