Reaction Details
TargetMethionine aminopeptidase
LigandBDBM50175442
Substrate/Competitorn/a
Meas. Tech.ChEMBL_451281 (CHEMBL901492)
IC50 141000±n/a nM
Citation Huang, MXie, SXMa, ZQHuang, QQNan, FJYe, QZ Inhibition of monometalated methionine aminopeptidase: inhibitor discovery and crystallographic analysis. J Med Chem50:5735-42 (2007) 
 
Methionine aminopeptidase
Name:Methionine aminopeptidase
Type:Enzyme
Mol. Mass.:29326.96
Organism:Escherichia coli (strain K12)
Description:Full-length untagged EcMAP was expressed in E. coli.
Residue:264
BDBM50175442
NameBDBM50175442
Synonyms:5-(2-chlorophenyl)furan-2-carboxylic acid cid_784625
TypeSmall organic molecule
Emp. Form.C11H7ClO3
Mol. Mass.222.624
SMILESOC(=O)c1ccc(o1)-c1ccccc1Cl