Reaction Details
TargetCannabinoid receptor 2
LigandBDBM50226179
Substrate/Competitorn/a
Meas. Tech.ChEMBL_451877 (CHEMBL901032)
Ki 24500±n/a nM
Citation Srivastava, BKJoharapurkar, ARaval, SPatel, JZSoni, RRaval, PGite, AGoswami, ASadhwani, NGandhi, NPatel, HMishra, BSolanki, MPandey, BJain, MRPatel, PR Diaryl dihydropyrazole-3-carboxamides with significant in vivo antiobesity activity related to CB1 receptor antagonism: synthesis, biological evaluation, and molecular modeling in the homology model. J Med Chem50:5951-66 (2007) 
 
Cannabinoid receptor 2
Name:Cannabinoid receptor 2
Type:G Protein-Coupled Receptor (GPCR)
Mol. Mass.:39690.94
Organism:Homo sapiens (Human)
Description:P34972
Residue:360
BDBM50226179
NameBDBM50226179
Synonyms:(+)-5-(4-chlorophenyl)-1-(2,4-dichlorophenyl)-4,5-dihydro-1H-pyrazole-3-carboxylic acid morpholin-4-ylamide bisulphate salt 5-(4-chlorophenyl)-1-(2,4-dichlorophenyl)-4,5-dihydro-1H-pyrazole-3-carboxylic acid morpholin-4-ylamide bisulphate salt | CHEMBL239703
TypeSmall organic molecule
Emp. Form.C20H19Cl3N4O2
Mol. Mass.453.749
SMILESClc1ccc(cc1)C1CC(=NN1c1ccc(Cl)cc1Cl)C(=O)NN1CCOCC1