Reaction Details
TargetBeta-secretase 1
LigandBDBM50226440
Substrate/Competitorn/a
Meas. Tech.ChEMBL_451978 (CHEMBL901136)
IC50 3500±n/a nM
Citation Edwards, PDAlbert, JSSylvester, MAharony, DAndisik, DCallaghan, OCampbell, JBCarr, RAChessari, GCongreve, MFrederickson, MFolmer, RHGeschwindner, SKoether, GKolmodin, KKrumrine, JMauger, RCMurray, CWOlsson, LLPatel, SSpear, NTian, G Application of fragment-based lead generation to the discovery of novel, cyclic amidine beta-secretase inhibitors with nanomolar potency, cellular activity, and high ligand efficiency. J Med Chem50:5912-25 (2007) 
 
Beta-secretase 1
Name:Beta-secretase 1
Type:Protein
Mol. Mass.:55755.10
Organism:Homo sapiens (Human)
Description:P56817
Residue:501
BDBM50226440
NameBDBM50226440
Synonyms:2-amino-6-(3,4-dichlorophenyl)-3,6-dimethyl-5,6-dihydro-3H-pyrimidin-4-one | CHEMBL239425
TypeSmall organic molecule
Emp. Form.C12H13Cl2N3O
Mol. Mass.286.157
SMILESCN1C(N)=NC(C)(CC1=O)c1ccc(Cl)c(Cl)c1