Reaction Details
TargetBeta-secretase 1
LigandBDBM50226453
Substrate/Competitorn/a
Meas. Tech.ChEMBL_451976 (CHEMBL901134)
IC50 5700±n/a nM
Citation Edwards, PDAlbert, JSSylvester, MAharony, DAndisik, DCallaghan, OCampbell, JBCarr, RAChessari, GCongreve, MFrederickson, MFolmer, RHGeschwindner, SKoether, GKolmodin, KKrumrine, JMauger, RCMurray, CWOlsson, LLPatel, SSpear, NTian, G Application of fragment-based lead generation to the discovery of novel, cyclic amidine beta-secretase inhibitors with nanomolar potency, cellular activity, and high ligand efficiency. J Med Chem50:5912-25 (2007) 
 
Beta-secretase 1
Name:Beta-secretase 1
Type:Protein
Mol. Mass.:55755.10
Organism:Homo sapiens (Human)
Description:P56817
Residue:501
BDBM50226453
NameBDBM50226453
Synonyms:2-amino-6-[2-(3'-methoxy-1,1'-biphenyl-3-yl)ethyl]-3-methylpyrimidin-4(3H)-one | CHEMBL235754
TypeSmall organic molecule
Emp. Form.C20H21N3O2
Mol. Mass.335.3996
SMILESCOc1cccc(c1)-c1cccc(CCc2cc(=O)n(C)c(N)n2)c1