Reaction Details
TargetBeta-secretase 1
LigandBDBM50226455
Substrate/Competitorn/a
Meas. Tech.ChEMBL_451977 (CHEMBL901135)
IC50 1600±n/a nM
Citation Edwards, PDAlbert, JSSylvester, MAharony, DAndisik, DCallaghan, OCampbell, JBCarr, RAChessari, GCongreve, MFrederickson, MFolmer, RHGeschwindner, SKoether, GKolmodin, KKrumrine, JMauger, RCMurray, CWOlsson, LLPatel, SSpear, NTian, G Application of fragment-based lead generation to the discovery of novel, cyclic amidine beta-secretase inhibitors with nanomolar potency, cellular activity, and high ligand efficiency. J Med Chem50:5912-25 (2007) 
 
Beta-secretase 1
Name:Beta-secretase 1
Type:Protein
Mol. Mass.:55755.10
Organism:Homo sapiens (Human)
Description:P56817
Residue:501
BDBM50226455
NameBDBM50226455
Synonyms:2-amino-6-[2-(1,1'-biphenyl-3-yl)ethyl]-3,6-dimethyl-5,6-dihydropyrimidin-4(3H)-one | CHEMBL239640
TypeSmall organic molecule
Emp. Form.C20H23N3O
Mol. Mass.321.4161
SMILESCN1C(=O)CC(C)(CCc2cccc(c2)-c2ccccc2)N=C1N