Reaction Details
TargetC-X-C chemokine receptor type 1
LigandBDBM50226995
Substrate/Competitorn/a
Meas. Tech.ChEMBL_461467 (CHEMBL927477)
Ki 130±n/a nM
Citation Biju, PTaveras, AYu, YZheng, JChao, JRindgen, DJakway, JHipkin, RWFossetta, JFan, XFine, JQiu, HMerritt, JRBaldwin, JJ 3,4-Diamino-2,5-thiadiazole-1-oxides as potent CXCR2/CXCR1 antagonists. Bioorg Med Chem Lett18:228-31 (2008) 
 
C-X-C chemokine receptor type 1
Name:C-X-C chemokine receptor type 1
Type:Enzyme
Mol. Mass.:39803.83
Organism:Homo sapiens (Human)
Description:P25024
Residue:350
BDBM50226995
NameBDBM50226995
Synonyms:3-[4-((R)-2,2-dimethyl-1-phenyl-propylamino)-1-oxo-1H-1lambda4-[1,2,5]thiadiazol-3-ylamino]-2-hydroxy-N,N-dimethyl-benzamide | CHEMBL253305
TypeSmall organic molecule
Emp. Form.C22H27N5O3S
Mol. Mass.441.546
SMILESCN(C)C(=O)c1cccc(Nc2ns(=O)nc2N[C@@H](c2ccccc2)C(C)(C)C)c1O