Reaction Details
TargetC-X-C chemokine receptor type 1
LigandBDBM50227008
Substrate/Competitorn/a
Meas. Tech.ChEMBL_461467 (CHEMBL927477)
Ki 2000±n/a nM
Citation Biju, PTaveras, AYu, YZheng, JChao, JRindgen, DJakway, JHipkin, RWFossetta, JFan, XFine, JQiu, HMerritt, JRBaldwin, JJ 3,4-Diamino-2,5-thiadiazole-1-oxides as potent CXCR2/CXCR1 antagonists. Bioorg Med Chem Lett18:228-31 (2008) 
 
C-X-C chemokine receptor type 1
Name:C-X-C chemokine receptor type 1
Type:Enzyme
Mol. Mass.:39803.83
Organism:Homo sapiens (Human)
Description:P25024
Residue:350
BDBM50227008
NameBDBM50227008
Synonyms:3-{4-[(R)-1-(2,3-dihydro-benzo[1,4]dioxin-6-yl)-2,2-dimethyl-propylamino]-1,1-dioxo-1H-1lambda6-[1,2,5]thiadiazol-3-ylamino}-2-hydroxy-N,N-dimethyl-benzamide | CHEMBL404381
TypeSmall organic molecule
Emp. Form.C24H29N5O6S
Mol. Mass.515.582
SMILESCN(C)C(=O)c1cccc(N=C2NS(=O)(=O)N=C2N[C@@H](c2ccc3OCCOc3c2)C(C)(C)C)c1O