Reaction Details
TargetMycothiol S-conjugate amidase
LigandBDBM50227093
Substrate/Competitorn/a
Meas. Tech.ChEMBL_452330 (CHEMBL902567)
IC50 120000±n/a nM
Citation Metaferia, BBFetterolf, BJShazad-Ul-Hussan, SMoravec, MSmith, JARay, SGutierrez-Lugo, MTBewley, CA Synthesis of natural product-inspired inhibitors of Mycobacterium tuberculosis mycothiol-associated enzymes: the first inhibitors of GlcNAc-Ins deacetylase. J Med Chem50:6326-36 (2007) 
 
Mycothiol S-conjugate amidase
Name:Mycothiol S-conjugate amidase
Type:PROTEIN
Mol. Mass.:32719.79
Organism:Mycobacterium tuberculosis
Description:ChEMBL_626858
Residue:288
BDBM50227093
NameBDBM50227093
Synonyms:CHEMBL238782 | N-((2R,3R,4R,5S,6R)-2-(cyclohexylthio)-4,5-dihydroxy-6-(hydroxymethyl)-tetrahydro-2H-pyran-3-yl)-4-phenylbutane-1-sulfonamide
TypeSmall organic molecule
Emp. Form.C22H35NO6S2
Mol. Mass.473.646
SMILESOC[C@@H]1O[C@@H](SC2CCCCC2)[C@@H](NS(=O)(=O)CCCCc2ccccc2)[C@H](O)[C@H]1O