Reaction Details
TargetSomatostatin receptor type 5
LigandBDBM50227117
Substrate/Competitorn/a
Meas. Tech.ChEMBL_452331 (CHEMBL902568)
Ki 37±n/a nM
Citation Martin, REGreen, LGGuba, WKratochwil, NChrist, A Discovery of the first nonpeptidic, small-molecule, highly selective somatostatin receptor subtype 5 antagonists: a chemogenomics approach. J Med Chem50:6291-4 (2007) 
 
Somatostatin receptor type 5
Name:Somatostatin receptor type 5
Type:Enzyme
Mol. Mass.:39218.02
Organism:Homo sapiens (Human)
Description:P35346
Residue:364
BDBM50227117
NameBDBM50227117
Synonyms:CHEMBL236611 | N-(1-(3-ethoxy-4-methylbenzyl)piperidin-4-yl)benzo[d]oxazol-2-amine
TypeSmall organic molecule
Emp. Form.C22H27N3O2
Mol. Mass.365.4687
SMILESCCOc1cc(CN2CCC(CC2)Nc2nc3ccccc3o2)ccc1C