Reaction Details
TargetC-X-C chemokine receptor type 3
LigandBDBM50227869
Substrate/Competitorn/a
Meas. Tech.ChEMBL_461636 (CHEMBL928754)
Ki 120±n/a nM
Citation Watson, RJAllen, DRBirch, HLChapman, GAGalvin, FCJopling, LAKnight, RLMeier, DOliver, KMeissner, JWOwen, DAThomas, EJTremayne, NWilliams, SC Development of CXCR3 antagonists. Part 3: Tropenyl and homotropenyl-piperidine urea derivatives. Bioorg Med Chem Lett18:147-51 (2008) 
 
C-X-C chemokine receptor type 3
Name:C-X-C chemokine receptor type 3
Type:PROTEIN
Mol. Mass.:41020.84
Organism:Mus musculus
Description:ChEMBL_560734
Residue:367
BDBM50227869
NameBDBM50227869
Synonyms:1-[1-(8-acetyl-8-aza-bicyclo[3.2.1]oct-2-en-3-ylmethyl)-piperidin-4-yl]-3-(3-fluoro-5-trifluoromethyl-phenyl)-urea | CHEMBL403267
TypeSmall organic molecule
Emp. Form.C23H28F4N4O2
Mol. Mass.468.4876
SMILESCC(=O)N1C2CCC1C=C(CN1CCC(CC1)NC(=O)Nc1cc(F)cc(c1)C(F)(F)F)C2