Reaction Details
TargetCytochrome P450 2D6
LigandBDBM50198394
Substrate/Competitorn/a
Meas. Tech.ChEMBL_461650 (CHEMBL928768)
Ki 600±n/a nM
Citation Watson, RJAllen, DRBirch, HLChapman, GAGalvin, FCJopling, LAKnight, RLMeier, DOliver, KMeissner, JWOwen, DAThomas, EJTremayne, NWilliams, SC Development of CXCR3 antagonists. Part 3: Tropenyl and homotropenyl-piperidine urea derivatives. Bioorg Med Chem Lett18:147-51 (2008) 
 
Cytochrome P450 2D6
Name:Cytochrome P450 2D6
Type:Protein
Mol. Mass.:55774.82
Organism:Homo sapiens (Human)
Description:P10635
Residue:497
BDBM50198394
NameBDBM50198394
Synonyms:(E)-1-(1-(cyclooctenylmethyl)piperidin-4-yl)-3-(naphthalen-2-yl)urea CHEMBL244610
TypeSmall organic molecule
Emp. Form.C25H33N3O
Mol. Mass.391.549
SMILESO=C(NC1CCN(C\C2=C\CCCCCC2)CC1)Nc1ccc2ccccc2c1