Reaction Details
TargetC-X-C chemokine receptor type 3
LigandBDBM50227866
Substrate/Competitorn/a
Meas. Tech.ChEMBL_461631 (CHEMBL928749)
Ki 7±n/a nM
Citation Watson, RJAllen, DRBirch, HLChapman, GAGalvin, FCJopling, LAKnight, RLMeier, DOliver, KMeissner, JWOwen, DAThomas, EJTremayne, NWilliams, SC Development of CXCR3 antagonists. Part 3: Tropenyl and homotropenyl-piperidine urea derivatives. Bioorg Med Chem Lett18:147-51 (2008) 
 
C-X-C chemokine receptor type 3
Name:C-X-C chemokine receptor type 3
Type:Enzyme Catalytic Domain
Mol. Mass.:40665.65
Organism:Homo sapiens (Human)
Description:n/a
Residue:368
BDBM50227866
NameBDBM50227866
Synonyms:1-(8-((9-acetyl-9-aza-bicyclo[3.3.1]non-2-en-3-yl)methyl)-8-aza-bicyclo[3.2.1]octan-3-yl)-3-(3-fluoro-5-(trifluoromethyl)phenyl)urea | CHEMBL252258
TypeSmall organic molecule
Emp. Form.C26H32F4N4O2
Mol. Mass.508.5515
SMILESCC(=O)N1C2CCCC1C=C(CN1C3CCC1CC(C3)NC(=O)Nc1cc(F)cc(c1)C(F)(F)F)C2