Reaction Details
Target5-hydroxytryptamine receptor 2A
LigandBDBM28583
Substrate/Competitorn/a
Meas. Tech.ChEMBL_461683 (CHEMBL927704)
Ki 1740±n/a nM
Citation Seong, CMPark, WKPark, CMKong, JYPark, NS Discovery of 3-aryl-3-methyl-1H-quinoline-2,4-diones as a new class of selective 5-HT6 receptor antagonists. Bioorg Med Chem Lett18:738-43 (2008) 
 
5-hydroxytryptamine receptor 2A
Name:5-hydroxytryptamine receptor 2A
Type:undefined
Mol. Mass.:52607.65
Organism:Homo sapiens (Human)
Description:P28223
Residue:471
BDBM28583
NameBDBM28583
Synonyms:5-chloro-N-[4-methoxy-3-(piperazin-1-yl)phenyl]-3-methyl-1-benzothiophene-2-sulfonamide hydrochloride SB 271046 | SB-271046
TypeSmall organic molecule
Emp. Form.C20H22ClN3O3S2
Mol. Mass.451.99
SMILESCOc1ccc(NS(=O)(=O)c2sc3ccc(Cl)cc3c2C)cc1N1CCNCC1