Reaction Details
Target5-hydroxytryptamine receptor 6
LigandBDBM50228650
Substrate/Competitorn/a
Meas. Tech.ChEMBL_461681 (CHEMBL927702)
Ki>1000±n/a nM
Citation Seong, CMPark, WKPark, CMKong, JYPark, NS Discovery of 3-aryl-3-methyl-1H-quinoline-2,4-diones as a new class of selective 5-HT6 receptor antagonists. Bioorg Med Chem Lett18:738-43 (2008) 
 
5-hydroxytryptamine receptor 6
Name:5-hydroxytryptamine receptor 6
Type:G Protein-Coupled Receptor (GPCR)
Mol. Mass.:46968.43
Organism:Homo sapiens (Human)
Description:P50406
Residue:440
BDBM50228650
NameBDBM50228650
Synonyms:6,8-dibromo-3-methyl-3-phenylquinoline-2,4(1H,3H)-dione | CHEMBL253281
TypeSmall organic molecule
Emp. Form.C16H11Br2NO2
Mol. Mass.409.072
SMILESCC1(C(=O)Nc2c(Br)cc(Br)cc2C1=O)c1ccccc1