Reaction Details
TargetD(2) dopamine receptor
LigandBDBM50228647
Substrate/Competitorn/a
Meas. Tech.ChEMBL_461687 (CHEMBL927708)
Ki>10000±n/a nM
Citation Seong, CMPark, WKPark, CMKong, JYPark, NS Discovery of 3-aryl-3-methyl-1H-quinoline-2,4-diones as a new class of selective 5-HT6 receptor antagonists. Bioorg Med Chem Lett18:738-43 (2008) 
 
D(2) dopamine receptor
Name:D(2) dopamine receptor
Type:Cell-surface receptors
Mol. Mass.:50647.10
Organism:Homo sapiens (Human)
Description:P14416
Residue:443
BDBM50228647
NameBDBM50228647
Synonyms:3-(3-(benzyloxy)phenyl)-5,7-dichloro-3-methylquinoline-2,4(1H,3H)-dione | CHEMBL253096
TypeSmall organic molecule
Emp. Form.C23H17Cl2NO3
Mol. Mass.426.292
SMILESCC1(C(=O)Nc2cc(Cl)cc(Cl)c2C1=O)c1cccc(OCc2ccccc2)c1