Reaction Details
Target5-hydroxytryptamine receptor 6
LigandBDBM50228674
Substrate/Competitorn/a
Meas. Tech.ChEMBL_461681 (CHEMBL927702)
Ki>1000±n/a nM
Citation Seong, CMPark, WKPark, CMKong, JYPark, NS Discovery of 3-aryl-3-methyl-1H-quinoline-2,4-diones as a new class of selective 5-HT6 receptor antagonists. Bioorg Med Chem Lett18:738-43 (2008) 
 
5-hydroxytryptamine receptor 6
Name:5-hydroxytryptamine receptor 6
Type:G Protein-Coupled Receptor (GPCR)
Mol. Mass.:46968.43
Organism:Homo sapiens (Human)
Description:P50406
Residue:440
BDBM50228674
NameBDBM50228674
Synonyms:5,7-dichloro-3-(4-methoxy-3-nitrophenyl)-3-methylquinoline-2,4(1H,3H)-dione | CHEMBL253097
TypeSmall organic molecule
Emp. Form.C17H12Cl2N2O5
Mol. Mass.395.194
SMILESCOc1ccc(cc1[N+]([O-])=O)C1(C)C(=O)Nc2cc(Cl)cc(Cl)c2C1=O