Reaction Details
TargetPeroxisome proliferator-activated receptor alpha
LigandBDBM28706
Substrate/Competitorn/a
Meas. Tech.ChEMBL_461774 (CHEMBL927780)
EC50 20±n/a nM
Citation Faucher, NMartres, PLaroze, APineau, OPotvain, FGrillot, D Design, synthesis and evaluation of trifluoromethane sulfonamide derivatives as new potent and selective peroxisome proliferator-activated receptor alpha agonists. Bioorg Med Chem Lett18:710-5 (2008) 
 
Peroxisome proliferator-activated receptor alpha
Name:Peroxisome proliferator-activated receptor alpha
Type:PROTEIN
Mol. Mass.:52343.28
Organism:Mus musculus
Description:ChEMBL_572395
Residue:468
BDBM28706
NameBDBM28706
Synonyms:2-methyl-2-phenoxypropanoic acid, 25a CHEMBL219586
TypeSmall organic molecule
Emp. Form.C23H21F3N2O4S
Mol. Mass.478.484
SMILESCc1nc(sc1C(=O)NCc1ccc(OC(C)(C)C(O)=O)cc1)-c1ccc(cc1)C(F)(F)F