Reaction Details
TargetPeroxisome proliferator-activated receptor alpha
LigandBDBM50229214
Substrate/Competitorn/a
Meas. Tech.ChEMBL_461773 (CHEMBL927779)
EC50 1000±n/a nM
Citation Faucher, NMartres, PLaroze, APineau, OPotvain, FGrillot, D Design, synthesis and evaluation of trifluoromethane sulfonamide derivatives as new potent and selective peroxisome proliferator-activated receptor alpha agonists. Bioorg Med Chem Lett18:710-5 (2008) 
 
Peroxisome proliferator-activated receptor alpha
Name:Peroxisome proliferator-activated receptor alpha
Type:Enzyme
Mol. Mass.:52222.08
Organism:Homo sapiens (Human)
Description:Q07869
Residue:468
BDBM50229214
NameBDBM50229214
Synonyms:2-(4-{[(4'-cyano-biphenyl-4-carbonyl)-amino]-methyl}-phenoxy)-2-methyl-propionic acid | CHEMBL401560
TypeSmall organic molecule
Emp. Form.C25H22N2O4
Mol. Mass.414.4532
SMILESCC(C)(Oc1ccc(CNC(=O)c2ccc(cc2)-c2ccc(cc2)C#N)cc1)C(O)=O