Reaction Details
TargetPeroxisome proliferator-activated receptor gamma
LigandBDBM50229219
Substrate/Competitorn/a
Meas. Tech.ChEMBL_461781 (CHEMBL927787)
EC50 600±n/a nM
Citation Faucher, NMartres, PLaroze, APineau, OPotvain, FGrillot, D Design, synthesis and evaluation of trifluoromethane sulfonamide derivatives as new potent and selective peroxisome proliferator-activated receptor alpha agonists. Bioorg Med Chem Lett18:710-5 (2008) 
 
Peroxisome proliferator-activated receptor gamma
Name:Peroxisome proliferator-activated receptor gamma
Type:PROTEIN
Mol. Mass.:57593.55
Organism:Mus musculus
Description:ChEMBL_1453700
Residue:505
BDBM50229219
NameBDBM50229219
Synonyms:4'-chloro-biphenyl-4-carboxylic acid 4-trifluoromethanesulfonylamino-benzylamide | CHEMBL252675
TypeSmall organic molecule
Emp. Form.C21H16ClF3N2O3S
Mol. Mass.468.877
SMILESFC(F)(F)S(=O)(=O)Nc1ccc(CNC(=O)c2ccc(cc2)-c2ccc(Cl)cc2)cc1