Reaction Details
TargetPeroxisome proliferator-activated receptor alpha
LigandBDBM50229223
Substrate/Competitorn/a
Meas. Tech.ChEMBL_461773 (CHEMBL927779)
EC50 20±n/a nM
Citation Faucher, NMartres, PLaroze, APineau, OPotvain, FGrillot, D Design, synthesis and evaluation of trifluoromethane sulfonamide derivatives as new potent and selective peroxisome proliferator-activated receptor alpha agonists. Bioorg Med Chem Lett18:710-5 (2008) 
 
Peroxisome proliferator-activated receptor alpha
Name:Peroxisome proliferator-activated receptor alpha
Type:Enzyme
Mol. Mass.:52222.08
Organism:Homo sapiens (Human)
Description:Q07869
Residue:468
BDBM50229223
NameBDBM50229223
Synonyms:4'-cyano-biphenyl-4-carboxylic acid 4-trifluoromethanesulfonylamino-bezylamide | CHEMBL253486
TypeSmall organic molecule
Emp. Form.C22H16F3N3O3S
Mol. Mass.459.441
SMILESFC(F)(F)S(=O)(=O)Nc1ccc(CNC(=O)c2ccc(cc2)-c2ccc(cc2)C#N)cc1