Reaction Details
TargetPeroxisome proliferator-activated receptor delta
LigandBDBM50229217
Substrate/Competitorn/a
Meas. Tech.ChEMBL_461777 (CHEMBL927783)
EC50>10000±n/a nM
Citation Faucher, NMartres, PLaroze, APineau, OPotvain, FGrillot, D Design, synthesis and evaluation of trifluoromethane sulfonamide derivatives as new potent and selective peroxisome proliferator-activated receptor alpha agonists. Bioorg Med Chem Lett18:710-5 (2008) 
 
Peroxisome proliferator-activated receptor delta
Name:Peroxisome proliferator-activated receptor delta
Type:PROTEIN
Mol. Mass.:49719.14
Organism:Mus musculus
Description:ChEMBL_1288931
Residue:440
BDBM50229217
NameBDBM50229217
Synonyms:CHEMBL402100 | N-(4-(2,2,2-trifluoroacetamido)benzyl)-4-methyl-2-(4-(trifluoromethyl)phenyl)thiazole-5-carboxamide
TypeSmall organic molecule
Emp. Form.C21H15F6N3O2S
Mol. Mass.487.418
SMILESCc1nc(sc1C(=O)NCc1ccc(NC(=O)C(F)(F)F)cc1)-c1ccc(cc1)C(F)(F)F