Reaction Details
TargetPeroxisome proliferator-activated receptor delta
LigandBDBM50229215
Substrate/Competitorn/a
Meas. Tech.ChEMBL_461777 (CHEMBL927783)
EC50>10000±n/a nM
Citation Faucher, NMartres, PLaroze, APineau, OPotvain, FGrillot, D Design, synthesis and evaluation of trifluoromethane sulfonamide derivatives as new potent and selective peroxisome proliferator-activated receptor alpha agonists. Bioorg Med Chem Lett18:710-5 (2008) 
 
Peroxisome proliferator-activated receptor delta
Name:Peroxisome proliferator-activated receptor delta
Type:PROTEIN
Mol. Mass.:49719.14
Organism:Mus musculus
Description:ChEMBL_1288931
Residue:440
BDBM50229215
NameBDBM50229215
Synonyms:CHEMBL254540 | N-(4-((2H-tetrazol-5-yl)methoxy)benzyl)-4-methyl-2-(4-(trifluoromethyl)phenyl)thiazole-5-carboxamide
TypeSmall organic molecule
Emp. Form.C21H17F3N6O2S
Mol. Mass.474.459
SMILESCc1nc(sc1C(=O)NCc1ccc(OCc2nnn[nH]2)cc1)-c1ccc(cc1)C(F)(F)F