Reaction Details
TargetPeroxisome proliferator-activated receptor alpha
LigandBDBM50229206
Substrate/Competitorn/a
Meas. Tech.ChEMBL_461773 (CHEMBL927779)
EC50 0.3±n/a nM
Citation Faucher, NMartres, PLaroze, APineau, OPotvain, FGrillot, D Design, synthesis and evaluation of trifluoromethane sulfonamide derivatives as new potent and selective peroxisome proliferator-activated receptor alpha agonists. Bioorg Med Chem Lett18:710-5 (2008) 
 
Peroxisome proliferator-activated receptor alpha
Name:Peroxisome proliferator-activated receptor alpha
Type:Enzyme
Mol. Mass.:52222.08
Organism:Homo sapiens (Human)
Description:Q07869
Residue:468
BDBM50229206
NameBDBM50229206
Synonyms:CHEMBL253310 | N-(4-(trifluoromethylsulfonamido)benzyl)-4-methyl-2-(4-(trifluoromethyl)phenyl)thiazole-5-carboxamide
TypeSmall organic molecule
Emp. Form.C20H15F6N3O3S2
Mol. Mass.523.472
SMILESCc1nc(sc1C(=O)NCc1ccc(NS(=O)(=O)C(F)(F)F)cc1)-c1ccc(cc1)C(F)(F)F