Reaction Details
TargetC-X-C chemokine receptor type 3
LigandBDBM50229385
Substrate/Competitorn/a
Meas. Tech.ChEMBL_461808 (CHEMBL928937)
IC50 9±n/a nM
Citation Li, ARJohnson, MGLiu, JChen, XDu, XMihalic, JTDeignan, JGustin, DJDuquette, JFu, ZZhu, LMarcus, APBergeron, PMcGee, LRDanao, JLemon, BCarabeo, TSullivan, TMa, JTang, LTonn, GCollins, TLMedina, JC Optimization of the heterocyclic core of the quinazolinone-derived CXCR3 antagonists. Bioorg Med Chem Lett18:688-93 (2008) 
 
C-X-C chemokine receptor type 3
Name:C-X-C chemokine receptor type 3
Type:Enzyme Catalytic Domain
Mol. Mass.:40665.65
Organism:Homo sapiens (Human)
Description:n/a
Residue:368
BDBM50229385
NameBDBM50229385
Synonyms:(R)-N-(1-(3-(4-cyanophenyl)quinoxalin-2-yl)ethyl)-N-(2-(ethylsulfonyl)ethyl)-2-(4-fluoro-3-(trifluoromethyl)phenyl)acetamide | CHEMBL254082
TypeSmall organic molecule
Emp. Form.C30H26F4N4O3S
Mol. Mass.598.611
SMILESCCS(=O)(=O)CCN([C@H](C)c1nc2ccccc2nc1-c1ccc(cc1)C#N)C(=O)Cc1ccc(F)c(c1)C(F)(F)F