Reaction Details
TargetSialidase-4
LigandBDBM50229632
Substrate/Competitorn/a
Meas. Tech.ChEMBL_461857 (CHEMBL927850)
IC50 580000±n/a nM
Citation Magesh, SMoriya, SSuzuki, TMiyagi, TIshida, HKiso, M Design, synthesis, and biological evaluation of human sialidase inhibitors. Part 1: selective inhibitors of lysosomal sialidase (NEU1). Bioorg Med Chem Lett18:532-7 (2008) 
 
Sialidase-4
Name:Sialidase-4
Type:PROTEIN
Mol. Mass.:51579.82
Organism:Homo sapiens (Human)
Description:ChEMBL_960637
Residue:484
BDBM50229632
NameBDBM50229632
Synonyms:(4S,5R,6R)-5-acetamido-6-((1S,2S)-3-acetamido-1,2-dihydroxypropyl)-4-hydroxy-5,6-dihydro-4H-pyran-2-carboxylic acid | CHEMBL402360
TypeSmall organic molecule
Emp. Form.C13H20N2O8
Mol. Mass.332.3065
SMILESCC(=O)NC[C@H](O)[C@H](O)[C@@H]1OC(=C[C@H](O)[C@H]1NC(C)=O)C(O)=O