Reaction Details
TargetMatrix metalloproteinase-9
LigandBDBM50230499
Substrate/Competitorn/a
Meas. Tech.ChEMBL_461907 (CHEMBL944754)
IC50 1.3±n/a nM
Citation Yang, SMScannevin, RHWang, BBurke, SLHuang, ZKarnachi, PWilson, LJRhodes, KJLagu, BMurray, WV beta-N-Biaryl ether sulfonamide hydroxamates as potent gelatinase inhibitors: part 2. Optimization of alpha-amino substituents. Bioorg Med Chem Lett18:1140-5 (2008) 
 
Matrix metalloproteinase-9
Name:Matrix metalloproteinase-9
Type:Enzyme
Mol. Mass.:78452.28
Organism:Homo sapiens (Human)
Description:P14780
Residue:707
BDBM50230499
NameBDBM50230499
Synonyms:(S)-N-hydroxy-2-(isobutylamino)-3-(N-(4-(p-tolyloxy)phenyl)methan-2-ylsulfonamido)propanamide | CHEMBL253033
TypeSmall organic molecule
Emp. Form.C21H29N3O5S
Mol. Mass.435.537
SMILESCC(C)CN[C@@H](CN(c1ccc(Oc2ccc(C)cc2)cc1)S(C)(=O)=O)C(=O)NO