Reaction Details
TargetMatrix metalloproteinase-9
LigandBDBM50230533
Substrate/Competitorn/a
Meas. Tech.ChEMBL_461907 (CHEMBL944754)
IC50 4.8±n/a nM
Citation Yang, SMScannevin, RHWang, BBurke, SLHuang, ZKarnachi, PWilson, LJRhodes, KJLagu, BMurray, WV beta-N-Biaryl ether sulfonamide hydroxamates as potent gelatinase inhibitors: part 2. Optimization of alpha-amino substituents. Bioorg Med Chem Lett18:1140-5 (2008) 
 
Matrix metalloproteinase-9
Name:Matrix metalloproteinase-9
Type:Enzyme
Mol. Mass.:78452.28
Organism:Homo sapiens (Human)
Description:P14780
Residue:707
BDBM50230533
NameBDBM50230533
Synonyms:(S)-2-(4-acetylpiperazin-1-yl)-N-hydroxy-3-(N-(4-(4-(trifluoromethyl)phenoxy)phenyl)methan-2-ylsulfonamido)propanamide | CHEMBL430210
TypeSmall organic molecule
Emp. Form.C23H27F3N4O6S
Mol. Mass.544.544
SMILESCC(=O)N1CCN(CC1)[C@@H](CN(c1ccc(Oc2ccc(cc2)C(F)(F)F)cc1)S(C)(=O)=O)C(=O)NO