Reaction Details
TargetMatrix metalloproteinase-9
LigandBDBM50230524
Substrate/Competitorn/a
Meas. Tech.ChEMBL_461907 (CHEMBL944754)
IC50 1.7±n/a nM
Citation Yang, SMScannevin, RHWang, BBurke, SLHuang, ZKarnachi, PWilson, LJRhodes, KJLagu, BMurray, WV beta-N-Biaryl ether sulfonamide hydroxamates as potent gelatinase inhibitors: part 2. Optimization of alpha-amino substituents. Bioorg Med Chem Lett18:1140-5 (2008) 
 
Matrix metalloproteinase-9
Name:Matrix metalloproteinase-9
Type:Enzyme
Mol. Mass.:78452.28
Organism:Homo sapiens (Human)
Description:P14780
Residue:707
BDBM50230524
NameBDBM50230524
Synonyms:(S)-2-(cyclopentylamino)-N-hydroxy-3-(N-(4-(p-tolyloxy)phenyl)methan-2-ylsulfonamido)propanamide | CHEMBL398351
TypeSmall organic molecule
Emp. Form.C22H29N3O5S
Mol. Mass.447.548
SMILESCc1ccc(Oc2ccc(cc2)N(C[C@H](NC2CCCC2)C(=O)NO)S(C)(=O)=O)cc1