Reaction Details
TargetMatrix metalloproteinase-9
LigandBDBM50230505
Substrate/Competitorn/a
Meas. Tech.ChEMBL_461907 (CHEMBL944754)
IC50 1.8±n/a nM
Citation Yang, SMScannevin, RHWang, BBurke, SLHuang, ZKarnachi, PWilson, LJRhodes, KJLagu, BMurray, WV beta-N-Biaryl ether sulfonamide hydroxamates as potent gelatinase inhibitors: part 2. Optimization of alpha-amino substituents. Bioorg Med Chem Lett18:1140-5 (2008) 
 
Matrix metalloproteinase-9
Name:Matrix metalloproteinase-9
Type:Enzyme
Mol. Mass.:78452.28
Organism:Homo sapiens (Human)
Description:P14780
Residue:707
BDBM50230505
NameBDBM50230505
Synonyms:(S)-N-hydroxy-2-(pyridin-4-ylmethylamino)-3-(N-(4-(p-tolyloxy)phenyl)methan-2-ylsulfonamido)propanamide | CHEMBL253242
TypeSmall organic molecule
Emp. Form.C23H26N4O5S
Mol. Mass.470.541
SMILESCc1ccc(Oc2ccc(cc2)N(C[C@H](NCc2ccncc2)C(=O)NO)S(C)(=O)=O)cc1