Reaction Details
TargetMatrix metalloproteinase-9
LigandBDBM50230525
Substrate/Competitorn/a
Meas. Tech.ChEMBL_461907 (CHEMBL944754)
IC50 0.460000±n/a nM
Citation Yang, SMScannevin, RHWang, BBurke, SLHuang, ZKarnachi, PWilson, LJRhodes, KJLagu, BMurray, WV beta-N-Biaryl ether sulfonamide hydroxamates as potent gelatinase inhibitors: part 2. Optimization of alpha-amino substituents. Bioorg Med Chem Lett18:1140-5 (2008) 
 
Matrix metalloproteinase-9
Name:Matrix metalloproteinase-9
Type:Enzyme
Mol. Mass.:78452.28
Organism:Homo sapiens (Human)
Description:P14780
Residue:707
BDBM50230525
NameBDBM50230525
Synonyms:(S)-3-(N-(4-(4-chlorophenoxy)phenyl)methan-2-ylsulfonamido)-2-(cis-2,6-dimethylmorpholino)-N-hydroxypropanamide | CHEMBL400285
TypeSmall organic molecule
Emp. Form.C22H28ClN3O6S
Mol. Mass.497.992
SMILESC[C@H]1CN(C[C@@H](C)O1)[C@@H](CN(c1ccc(Oc2ccc(Cl)cc2)cc1)S(C)(=O)=O)C(=O)NO