Reaction Details
Target72 kDa type IV collagenase
LigandBDBM50230515
Substrate/Competitorn/a
Meas. Tech.ChEMBL_461906 (CHEMBL944753)
IC50 4.8±n/a nM
Citation Yang, SMScannevin, RHWang, BBurke, SLHuang, ZKarnachi, PWilson, LJRhodes, KJLagu, BMurray, WV beta-N-Biaryl ether sulfonamide hydroxamates as potent gelatinase inhibitors: part 2. Optimization of alpha-amino substituents. Bioorg Med Chem Lett18:1140-5 (2008) 
 
72 kDa type IV collagenase
Name:72 kDa type IV collagenase
Type:Enzyme
Mol. Mass.:73870.36
Organism:Homo sapiens (Human)
Description: P08253
Residue:660
BDBM50230515
NameBDBM50230515
Synonyms:(S)-2-(1,1-dioxo-1lambda*6*-thiomorpholin-4-yl)-N-hydroxy-3-{methanesulfonyl-[4-(4-trifluoromethyl-phenoxy)-phenyl]-amino}-propionamide | CHEMBL429123
TypeSmall organic molecule
Emp. Form.C21H24F3N3O7S2
Mol. Mass.551.556
SMILESCS(=O)(=O)N(C[C@H](N1CCS(=O)(=O)CC1)C(=O)NO)c1ccc(Oc2ccc(cc2)C(F)(F)F)cc1