Reaction Details
TargetBeta-secretase 2
LigandBDBM16751
Substrate/Competitorn/a
Meas. Tech.ChEMBL_462008 (CHEMBL944851)
IC50>50000±n/a nM
Citation Cole, DCStock, JRChopra, RCowling, REllingboe, JWFan, KYHarrison, BLHu, YJacobsen, SJennings, LDJin, GLohse, PAMalamas, MSManas, ESMoore, WJO'Donnell, MMOlland, AMRobichaud, AJSvenson, KWu, JWagner, EBard, J Acylguanidine inhibitors of beta-secretase: optimization of the pyrrole ring substituents extending into the S1 and S3 substrate binding pockets. Bioorg Med Chem Lett18:1063-6 (2008) 
 
Beta-secretase 2
Name:Beta-secretase 2
Type:Protein
Mol. Mass.:56171.20
Organism:Homo sapiens (Human)
Description:Q9Y5Z0
Residue:518
BDBM16751
NameBDBM16751
Synonyms:(N-(diaminomethylene)-2,4-diphenyl-1H-pyrrole-1-acetamide) CHEMBL217068 | N-(diaminomethylidene)-2-(2,5-diphenyl-1H-pyrrol-1-yl)acetamide
TypeSmall organic molecule
Emp. Form.C19H18N4O
Mol. Mass.318.3724
SMILESNC(=N)NC(=O)Cn1c(ccc1-c1ccccc1)-c1ccccc1