Reaction Details
TargetAdenosine receptor A2a
LigandBDBM21175
Substrate/Competitorn/a
Meas. Tech.ChEMBL_460899 (CHEMBL943926)
Ki 2±n/a nM
Citation Slee, DHZhang, XMoorjani, MLin, ELanier, MCChen, YRueter, JKLechner, SMMarkison, SMalany, SJoswig, TSantos, MGross, RSWilliams, JPCastro-Palomino, JCCrespo, MIPrat, MGual, SDíaz, JLWen, JO'Brien, ZSaunders, J Identification of novel, water-soluble, 2-amino-N-pyrimidin-4-yl acetamides as A2A receptor antagonists with in vivo efficacy. J Med Chem51:400-6 (2008) 
 
Adenosine receptor A2a
Name:Adenosine receptor A2a
Type:G Protein-Coupled Receptor (GPCR)
Mol. Mass.:44716.46
Organism:Homo sapiens (Human)
Description:P29274
Residue:412
BDBM21175
NameBDBM21175
Synonyms:CHEMBL252171 Pyrimidine analogue, 27
TypeSmall organic molecule
Emp. Form.C20H25N7O2
Mol. Mass.395.4582
SMILESCN1CCN(CC(=O)Nc2cc(nc(n2)-c2ccco2)-n2nc(C)cc2C)CC1