Reaction Details
TargetAdenosine receptor A1
LigandBDBM21173
Substrate/Competitorn/a
Meas. Tech.ChEMBL_460900 (CHEMBL943927)
Ki 1.6±n/a nM
Citation Slee, DHZhang, XMoorjani, MLin, ELanier, MCChen, YRueter, JKLechner, SMMarkison, SMalany, SJoswig, TSantos, MGross, RSWilliams, JPCastro-Palomino, JCCrespo, MIPrat, MGual, SDíaz, JLWen, JO'Brien, ZSaunders, J Identification of novel, water-soluble, 2-amino-N-pyrimidin-4-yl acetamides as A2A receptor antagonists with in vivo efficacy. J Med Chem51:400-6 (2008) 
 
Adenosine receptor A1
Name:Adenosine receptor A1
Type:G Protein-Coupled Receptor (GPCR)
Mol. Mass.:36520.92
Organism:Homo sapiens (Human)
Description:P30542
Residue:326
BDBM21173
NameBDBM21173
Synonyms:1,3-dipropyl-8-cyclopentylxanthine CHEMBL183 PD116948 | [3H]DPCPX
Typeradiolabeled ligand
Emp. Form.C16H24N4O2
Mol. Mass.304.3874
SMILESCCCn1c2nc([nH]c2c(=O)n(CCC)c1=O)C1CCCC1