Reaction Details
TargetRAC-alpha serine/threonine-protein kinase
LigandBDBM50234144
Substrate/Competitorn/a
Meas. Tech.ChEMBL_462553 (CHEMBL928479)
IC50>10000±n/a nM
Citation Furet, PCaravatti, GGuagnano, VLang, MMeyer, TSchoepfer, J Entry into a new class of protein kinase inhibitors by pseudo ring design. Bioorg Med Chem Lett18:897-900 (2008) 
 
RAC-alpha serine/threonine-protein kinase
Name:RAC-alpha serine/threonine-protein kinase
Type:Enzyme
Mol. Mass.:55681.25
Organism:Homo sapiens (Human)
Description:P31749
Residue:480
BDBM50234144
NameBDBM50234144
Synonyms:1-(2,6-dichlorophenyl)-3-(6-(4-(2-(diethylamino)ethoxy)phenylamino)pyrimidin-4-yl)urea | CHEMBL253292
TypeSmall organic molecule
Emp. Form.C23H26Cl2N6O2
Mol. Mass.489.398
SMILESCCN(CC)CCOc1ccc(Nc2cc(NC(=O)Nc3c(Cl)cccc3Cl)ncn2)cc1