Reaction Details
TargetPeroxisome proliferator-activated receptor alpha
LigandBDBM28798
Substrate/Competitorn/a
Meas. Tech.ChEMBL_462574 (CHEMBL928500)
EC50 37±n/a nM
Citation Parmenon, CGuillard, JCaignard, DHHennuyer, NStaels, BAudinot-Bouchez, VBoutin, JADacquet, CKtorza, AViaud-Massuard, MC 4,4-Dimethyl-1,2,3,4-tetrahydroquinoline-based PPARalpha/gamma agonists. Part I: synthesis and pharmacological evaluation. Bioorg Med Chem Lett18:1617-22 (2008) 
 
Peroxisome proliferator-activated receptor alpha
Name:Peroxisome proliferator-activated receptor alpha
Type:Enzyme
Mol. Mass.:52222.08
Organism:Homo sapiens (Human)
Description:Q07869
Residue:468
BDBM28798
NameBDBM28798
Synonyms:(2S)-2-ethoxy-3-(4-{2-[4-(methanesulfonyloxy)phenyl]ethoxy}phenyl)propanoic acid Galida | tesaglitazar
TypeSmall organic molecule
Emp. Form.C20H24O7S
Mol. Mass.408.465
SMILESCCO[C@@H](Cc1ccc(OCCc2ccc(OS(C)(=O)=O)cc2)cc1)C(O)=O