Reaction Details
TargetCytosol aminopeptidase
LigandBDBM50129684
Substrate/Competitorn/a
Meas. Tech.ChEMBL_462623 (CHEMBL929612)
Ki 66±n/a nM
Citation Mucha, ALämmerhofer, MLindner, WPawelczak, MKafarski, P Individual stereoisomers of phosphinic dipeptide inhibitor of leucine aminopeptidase. Bioorg Med Chem Lett18:1550-4 (2008) 
 
Cytosol aminopeptidase
Name:Cytosol aminopeptidase
Type:PROTEIN
Mol. Mass.:56171.75
Organism:Homo sapiens (Human)
Description:ChEMBL_1507539
Residue:519
BDBM50129684
NameBDBM50129684
Synonyms:3-[(1-amino-3-phenyl-propyl)-hydroxy-phosphinoyl]-2-benzyl-propionic acid | CHEMBL327844
TypeSmall organic molecule
Emp. Form.C19H24NO4P
Mol. Mass.361.3719
SMILESOC(=O)C(Cc1ccccc1)CP(O)(O)C(=N)CCc1ccccc1