Reaction Details
TargetSodium channel protein type 9 subunit alpha
LigandBDBM50216671
Substrate/Competitorn/a
Meas. Tech.ChEMBL_462700 (CHEMBL929673)
IC50 35±n/a nM
Citation Hoyt, SBLondon, CWyvratt, MJFisher, MHCashen, DEFelix, JPGarcia, MLLi, XLyons, KAEuan MacIntyre, DMartin, WJPriest, BTSmith, MMWarren, VAWilliams, BSKaczorowski, GJParsons, WH 3-Amino-1,5-benzodiazepinones: potent, state-dependent sodium channel blockers with anti-epileptic activity. Bioorg Med Chem Lett18:1963-6 (2008) 
 
Sodium channel protein type 9 subunit alpha
Name:Sodium channel protein type 9 subunit alpha
Type:Protein
Mol. Mass.:226375.97
Organism:Homo sapiens (Human)
Description:Q15858
Residue:1988
BDBM50216671
NameBDBM50216671
Synonyms:CHEMBL247828 | tert-butyl (R)-1-((R)-1-isopropyl-2-oxo-2,3,4,5-tetrahydro-1H-benzo[b]azepin-3-ylamino)-1-oxo-3-(2-(trifluoromethoxy)phenyl)propan-2-ylcarbamate
TypeSmall organic molecule
Emp. Form.C28H34F3N3O5
Mol. Mass.549.5819
SMILESCC(C)N1c2ccccc2CC[C@@H](NC(=O)[C@@H](Cc2ccccc2OC(F)(F)F)NC(=O)OC(C)(C)C)C1=O