Reaction Details
TargetAdenosine receptor A2a
LigandBDBM50237064
Substrate/Competitorn/a
Meas. Tech.ChEMBL_463084 (CHEMBL928994)
Ki 9.4±n/a nM
Citation Zhang, XRueter, JKChen, YMoorjani, MLanier, MCLin, EGross, RSTellew, JEWilliams, JPLechner, SMMarkison, SJoswig, TMalany, SSantos, MCastro-Palomino, JCCrespo, MIPrat, MGual, SDíaz, JLSaunders, JSlee, DH Synthesis of N-pyrimidinyl-2-phenoxyacetamides as adenosine A2A receptor antagonists. Bioorg Med Chem Lett18:1778-83 (2008) 
 
Adenosine receptor A2a
Name:Adenosine receptor A2a
Type:G Protein-Coupled Receptor (GPCR)
Mol. Mass.:45015.65
Organism:Rattus norvegicus (rat)
Description:Rat A2A receptors expressed in CHO cells.
Residue:410
BDBM50237064
NameBDBM50237064
Synonyms:CHEMBL401895 | N-(6-(3,5-dimethyl-1H-pyrazol-1-yl)-2-(5-methylfuran-2-yl)pyrimidin-4-yl)-2-(3-((dimethylamino)methyl)phenoxy)acetamide
TypeSmall organic molecule
Emp. Form.C25H28N6O3
Mol. Mass.460.5282
SMILESCN(C)Cc1cccc(OCC(=O)Nc2cc(nc(n2)-c2ccc(C)o2)-n2nc(C)cc2C)c1