Reaction Details
TargetAdenosine receptor A2a
LigandBDBM50237065
Substrate/Competitorn/a
Meas. Tech.ChEMBL_463076 (CHEMBL928986)
Ki 0.7±n/a nM
Citation Zhang, XRueter, JKChen, YMoorjani, MLanier, MCLin, EGross, RSTellew, JEWilliams, JPLechner, SMMarkison, SJoswig, TMalany, SSantos, MCastro-Palomino, JCCrespo, MIPrat, MGual, SDíaz, JLSaunders, JSlee, DH Synthesis of N-pyrimidinyl-2-phenoxyacetamides as adenosine A2A receptor antagonists. Bioorg Med Chem Lett18:1778-83 (2008) 
 
Adenosine receptor A2a
Name:Adenosine receptor A2a
Type:G Protein-Coupled Receptor (GPCR)
Mol. Mass.:44716.46
Organism:Homo sapiens (Human)
Description:P29274
Residue:412
BDBM50237065
NameBDBM50237065
Synonyms:2-(3-(aminomethyl)phenoxy)-N-(6-(3,5-dimethyl-1H-pyrazol-1-yl)-2-(5-methylfuran-2-yl)pyrimidin-4-yl)acetamide | CHEMBL403845
TypeSmall organic molecule
Emp. Form.C23H24N6O3
Mol. Mass.432.4751
SMILESCc1cc(C)n(n1)-c1cc(NC(=O)COc2cccc(CN)c2)nc(n1)-c1ccc(C)o1