Reaction Details
TargetDNA polymerase beta
LigandBDBM50079577
Substrate/Competitorn/a
Meas. Tech.ChEMBL_524724 (CHEMBL980279)
IC50 7500±n/a nM
Citation Deng, JZStarck, SRHecht, SM DNA polymerase beta inhibitors from Baeckea gunniana. J Nat Prod62:1624-6 (2000) DNA polymerase beta
Name:DNA polymerase beta
Type:PROTEIN
Mol. Mass.:38334.34
Organism:Rattus norvegicus
Description:ChEMBL_1361926
Residue:335
BDBM50079577
NameBDBM50079577
Synonyms:(4aS,6aS,6bR,10S,12aR,14bS)-10-Hydroxy-2,2,6a,6b,9,9,12a-heptamethyl-1,3,4,5,6,6a,6b,7,8,8a,9,10,11,12,12a,12b,13,14b-octadecahydro-2H-picene-4a-carboxylic acid CHEMBL168 | oleanolic acid
TypeSmall organic molecule
Emp. Form.C30H48O3
Mol. Mass.456.7003
SMILESCC1(C)CC[C@@]2(CC[C@]3(C)C(=CCC4[C@@]5(C)CC[C@H](O)C(C)(C)C5CC[C@@]34C)[C@@H]2C1)C(O)=O