Reaction Details
TargetDNA polymerase beta
LigandBDBM50148911
Substrate/Competitorn/a
Meas. Tech.ChEMBL_524725 (CHEMBL980280)
IC50 4800±n/a nM
Citation Deng, JZStarck, SRHecht, SM DNA polymerase beta inhibitors from Baeckea gunniana. J Nat Prod62:1624-6 (2000) DNA polymerase beta
Name:DNA polymerase beta
Type:PROTEIN
Mol. Mass.:38334.34
Organism:Rattus norvegicus
Description:ChEMBL_1361926
Residue:335
BDBM50148911
NameBDBM50148911
Synonyms:(3beta)-3-hydroxyurs-12-en-28-oic acid CHEMBL169 malol urson
TypeSmall organic molecule
Emp. Form.C30H48O3
Mol. Mass.456.7003
SMILESC[C@@H]1CC[C@@]2(CC[C@]3(C)C(=CC[C@@H]4[C@@]5(C)CC[C@H](O)C(C)(C)[C@@H]5CC[C@@]34C)[C@@H]2[C@H]1C)C(O)=O