Reaction Details
TargetProstaglandin G/H synthase 1
LigandBDBM50240485
Substrate/Competitorn/a
Meas. Tech.ChEMBL_508957 (CHEMBL1005509)
IC50>500000±n/a nM
Citation Ringbom, THuss, UStenholm, AFlock, SSkattebøl, LPerera, PBohlin, L Cox-2 inhibitory effects of naturally occurring and modified fatty acids. J Nat Prod64:745-9 (2001) Prostaglandin G/H synthase 1
Name:Prostaglandin G/H synthase 1
Type:PROTEIN
Mol. Mass.:68814.10
Organism:Bos taurus
Description:ChEMBL_547440
Residue:600
BDBM50240485
NameBDBM50240485
Synonyms:18:0 CH3-[CH2]16-COOH Octadecanoic acid Oktadekansaeure acide octadecanoique n-octadecanoic acid stearic acid
TypeSmall organic molecule
Emp. Form.C18H36O2
Mol. Mass.284.4772
(O)=O