Reaction Details
TargetAcetylcholinesterase
LigandBDBM50242345
Substrate/Competitorn/a
Meas. Tech.ChEMBL_509217 (CHEMBL995129)
IC50 46890±n/a nM
Citation Kalauni, SKChoudhary, MIShaheen, FManandhar, MDAtta-ur-Rahman, AGewali, MBKhalid, A Steroidal alkaloids from the leaves of Sarcococca coriacea of Nepalese origin. J Nat Prod64:842-4 (2001) Acetylcholinesterase
Name:Acetylcholinesterase
Type:Enzyme
Mol. Mass.:71812.79
Organism:Electrophorus electricus (Electric eel)
Description:n/a
Residue:633
BDBM50242345
NameBDBM50242345
Synonyms:CHEMBL460447 | [(20S)-20-(N,N-dimethylamino)-3 beta-(senecioylamino)-5 alpha-pregn-16-en-4 beta-yl acetate]
TypeSmall organic molecule
Emp. Form.C30H48N2O3
Mol. Mass.484.7137
SMILES[#6]-[#6@H](-[#7](-[#6])-[#6])-[#6]1=[#6]-[#6]-[#6@H]2-[#6@@H]-3-[#6]-[#6]-[#6@H]4-[#6@@H](-[#8]-[#6](-[#6])=O)-[#6@H](-[#6]-[#6][C@]4([#6])[#6@H]-3-[#6]-[#6][C@]12[#6])-[#7]-[#6](=O)\[#6]=[#6](/[#6])-[#6]