Reaction Details
TargetAcetylcholinesterase
LigandBDBM50242346
Substrate/Competitorn/a
Meas. Tech.ChEMBL_509217 (CHEMBL995129)
IC50 50100±n/a nM
Citation Kalauni, SKChoudhary, MIShaheen, FManandhar, MDAtta-ur-Rahman, AGewali, MBKhalid, A Steroidal alkaloids from the leaves of Sarcococca coriacea of Nepalese origin. J Nat Prod64:842-4 (2001) Acetylcholinesterase
Name:Acetylcholinesterase
Type:Enzyme
Mol. Mass.:71812.79
Organism:Electrophorus electricus (Electric eel)
Description:n/a
Residue:633
BDBM50242346
NameBDBM50242346
Synonyms:CHEMBL500603 | [(20S)-20-(N-methylamino)-3beta-(tigloylamino)-5alpha-pregn-16-en-2 beta,4 beta-diacetate]
TypeSmall organic molecule
Emp. Form.C31H48N2O5
Mol. Mass.528.7232
SMILESCN[C@@H](C)C1=CC[C@H]2[C@@H]3CC[C@H]4[C@@H](OC(C)=O)[C@@H](NC(=O)C(\C)=C\C)[C@H](C[C@]4(C)[C@H]3CC[C@]12C)OC(C)=O