Reaction Details
TargetDNA ligase
LigandBDBM50242374
Substrate/Competitorn/a
Meas. Tech.ChEMBL_509271 (CHEMBL996015)
IC50>250000±n/a nM
Citation Suzuki, KYahara, SMaehata, KUyeda, M Isoaurostatin, a novel topoisomerase inhibitor produced by Thermomonospora alba. J Nat Prod64:204-7 (2001) DNA ligase
Name:DNA ligase
Type:Enzyme
Mol. Mass.:55291.48
Organism:Bacteriophage T4
Description:n/a
Residue:487
BDBM50242374
NameBDBM50242374
Synonyms:CHEMBL505529 | topostatin
TypeSmall organic molecule
Emp. Form.C36H58N4O11S
Mol. Mass.754.931
SMILESCCCCCCCC(C)CC=C(C)C=CC(=O)C(C)CCC1OC(=O)[C@H](CC(OS(O)(=O)=O)C(N)=O)NC(=O)[C@@H](C)CNC(=O)C(=C)NC(=O)C1C